Target
Neuronal acetylcholine receptor subunit alpha-7
Ligand
BDBM50398850
Substrate
Meas. Tech.
ChEMBL_873559 (CHEMBL2187476)
Ki
3.3±n/a nM
Citation
 Breining, SRMelvin, MBhatti, BSByrd, GDKiser, MNHepler, CDHooker, DNZhang, JReynolds, LABenson, LRFedorov, NBSidach, SSMitchener, JPLucero, LMLukas, RJWhiteaker, PYohannes, D Structure-activity studies of 7-heteroaryl-3-azabicyclo[3.3.1]non-6-enes: a novel class of highly potent nicotinic receptor ligands. J Med Chem 55:9929-45 (2012)  
Target
Name:
Neuronal acetylcholine receptor subunit alpha-7
Synonyms:
ACHA7_HUMAN Cholinergic, Nicotinic Alpha7 Neuronal acetylcholine receptor protein alpha-7 subunit Nicotinic acetylcholine receptor alpha-7 (alpha7 nAChR)
Type:
Mol. Mass.:
56448.33
Organism:
Homo sapiens (Human)
Description:
CHRNA7 (NACHRA7)
Residue:
502
  
Inhibitor
Name:
BDBM50398850
Synonyms:
CHEMBL2177552
Type:
Small organic molecule
Emp. Form.:
C13H15FN2
Mol. Mass.:
218.27
SMILES:
Fc1cncc(c1)C1=C[C@H]2CNC[C@H](C2)C1
: