Target
Sphingosine 1-phosphate receptor 1
Ligand
BDBM50399042
Substrate
Meas. Tech.
ChEMBL_878769 (CHEMBL2183709)
IC50
2.1±n/a nM
Citation
 Angst, DJanser, PQuancard, JBuehlmayer, PBerst, FOberer, LBeerli, CStreiff, MPally, CHersperger, RBruns, CBassilana, FBollbuck, B An oral sphingosine 1-phosphate receptor 1 (S1P(1)) antagonist prodrug with efficacy in vivo: discovery, synthesis, and evaluation. J Med Chem 55:9722-34 (2012)  
Target
Name:
Sphingosine 1-phosphate receptor 1
Synonyms:
CHEDG1 Endothelial differentiation G-protein coupled receptor 1 S1P1 S1PR1_HUMAN Sphingosine 1-phosphate receptor Edg-1
Type:
Enzyme
Mol. Mass.:
42836.02
Organism:
Homo sapiens (Human)
Description:
P21453
Residue:
382
  
Inhibitor
Name:
BDBM50399042
Synonyms:
CHEMBL2178812
Type:
Small organic molecule
Emp. Form.:
C27H30ClN3O5S
Mol. Mass.:
544.062
SMILES:
Cc1cc(c(C)cc1Cl)S(=O)(=O)Nc1cccc(c1)-c1cc(C)c(C(=O)N[C@@H](CCN)C(O)=O)c(C)c1
: