Target
Sphingosine 1-phosphate receptor 1
Ligand
BDBM50399043
Substrate
Meas. Tech.
ChEMBL_878769 (CHEMBL2183709)
IC50
8.4±n/a nM
Citation
 Angst, DJanser, PQuancard, JBuehlmayer, PBerst, FOberer, LBeerli, CStreiff, MPally, CHersperger, RBruns, CBassilana, FBollbuck, B An oral sphingosine 1-phosphate receptor 1 (S1P(1)) antagonist prodrug with efficacy in vivo: discovery, synthesis, and evaluation. J Med Chem 55:9722-34 (2012)  
Target
Name:
Sphingosine 1-phosphate receptor 1
Synonyms:
CHEDG1 Endothelial differentiation G-protein coupled receptor 1 S1P1 S1PR1_HUMAN Sphingosine 1-phosphate receptor Edg-1
Type:
Enzyme
Mol. Mass.:
42836.02
Organism:
Homo sapiens (Human)
Description:
P21453
Residue:
382
  
Inhibitor
Name:
BDBM50399043
Synonyms:
CHEMBL2178811
Type:
Small organic molecule
Emp. Form.:
C29H34ClN3O5S
Mol. Mass.:
572.115
SMILES:
CN(C)C[C@H](N(C)C(=O)c1c(C)cc(cc1C)-c1cccc(NS(=O)(=O)c2cc(C)c(Cl)cc2C)c1)C(O)=O
: