Target
Sphingosine 1-phosphate receptor 3
Ligand
BDBM50399039
Substrate
Meas. Tech.
ChEMBL_874563 (CHEMBL2186199)
EC50
>10000±n/a nM
Citation
 Angst, DJanser, PQuancard, JBuehlmayer, PBerst, FOberer, LBeerli, CStreiff, MPally, CHersperger, RBruns, CBassilana, FBollbuck, B An oral sphingosine 1-phosphate receptor 1 (S1P(1)) antagonist prodrug with efficacy in vivo: discovery, synthesis, and evaluation. J Med Chem 55:9722-34 (2012)  
Target
Name:
Sphingosine 1-phosphate receptor 3
Synonyms:
C9orf108 EDG3 S1P receptor 3 S1P3 S1PR3_HUMAN Sphingosine 1-phosphate receptor 3 (S1P3) | Sphingosine 1-phosphate receptor Edg-3
Type:
G Protein-Coupled Receptor (GPCR)
Mol. Mass.:
42278.13
Organism:
Homo sapiens (Human)
Description:
Q99500
Residue:
378
  
Inhibitor
Name:
BDBM50399039
Synonyms:
CHEMBL2178814
Type:
Small organic molecule
Emp. Form.:
C30H36ClN3O5S
Mol. Mass.:
586.142
SMILES:
CN(C)CC[C@H](N(C)C(=O)c1c(C)cc(cc1C)-c1cccc(NS(=O)(=O)c2cc(C)c(Cl)cc2C)c1)C(O)=O
: