Target
Sphingosine 1-phosphate receptor 2
Ligand
BDBM50399039
Substrate
Meas. Tech.
ChEMBL_874564 (CHEMBL2186200)
EC50
>10000±n/a nM
Citation
 Angst, DJanser, PQuancard, JBuehlmayer, PBerst, FOberer, LBeerli, CStreiff, MPally, CHersperger, RBruns, CBassilana, FBollbuck, B An oral sphingosine 1-phosphate receptor 1 (S1P(1)) antagonist prodrug with efficacy in vivo: discovery, synthesis, and evaluation. J Med Chem 55:9722-34 (2012)  
Target
Name:
Sphingosine 1-phosphate receptor 2
Synonyms:
EDG5 S1PR2 Sphingosine 1-phosphate receptor Sphingosine-1-phosphate receptor 2 | ndothelial differentiation G-protein coupled receptor 5
Type:
G Protein-Coupled Receptor (GPCR)
Mol. Mass.:
38883.16
Organism:
Homo sapiens (Human)
Description:
Membranes isolated from S1P2-transfected CHO cells were used in ligand binding assay.
Residue:
353
  
Inhibitor
Name:
BDBM50399039
Synonyms:
CHEMBL2178814
Type:
Small organic molecule
Emp. Form.:
C30H36ClN3O5S
Mol. Mass.:
586.142
SMILES:
CN(C)CC[C@H](N(C)C(=O)c1c(C)cc(cc1C)-c1cccc(NS(=O)(=O)c2cc(C)c(Cl)cc2C)c1)C(O)=O
: