Target
5-hydroxytryptamine receptor 3A
Ligand
BDBM50399622
Substrate
Meas. Tech.
ChEMBL_878523 (CHEMBL2188188)
Ki
>10000±n/a nM
Citation
 Dubost, EDumas, NFossey, CMagnelli, RButt-Gueulle, SBallandonne, CCaignard, DHDulin, FSopkova de-Oliveira Santos, JMillet, PCharnay, YRault, SCailly, TFabis, F Synthesis and structure-affinity relationships of selective high-affinity 5-HT(4) receptor antagonists: application to the design of new potential single photon emission computed tomography tracers. J Med Chem 55:9693-707 (2012)  
Target
Name:
5-hydroxytryptamine receptor 3A
Synonyms:
5-HT-3 5-HT3A 5-hydroxytryptamine receptor 3 (5-HT3) 5-hydroxytryptamine receptor 3A (5HT3A) 5HT3R HTR3A Serotonin 3 receptor (5HT3) Serotonin-gated ion channel receptor | Serotonin-gated ion channel receptor 3
Type:
Protein
Mol. Mass.:
55283.27
Organism:
Homo sapiens (Human)
Description:
P46098
Residue:
478
  
Inhibitor
Name:
BDBM50399622
Synonyms:
CHEMBL2181168
Type:
Small organic molecule
Emp. Form.:
C21H24IN3O
Mol. Mass.:
461.3392
SMILES:
CCCN1CCC(COc2nc3c(I)cccc3c3ncccc23)CC1
: