Target
5-hydroxytryptamine receptor 1A
Ligand
BDBM50399622
Substrate
Meas. Tech.
ChEMBL_878529 (CHEMBL2188194)
Ki
5629±n/a nM
Citation
 Dubost, EDumas, NFossey, CMagnelli, RButt-Gueulle, SBallandonne, CCaignard, DHDulin, FSopkova de-Oliveira Santos, JMillet, PCharnay, YRault, SCailly, TFabis, F Synthesis and structure-affinity relationships of selective high-affinity 5-HT(4) receptor antagonists: application to the design of new potential single photon emission computed tomography tracers. J Med Chem 55:9693-707 (2012)  
Target
Name:
5-hydroxytryptamine receptor 1A
Synonyms:
5-HT-1A 5-hydroxytryptamine receptor 1A (5-HT-1A) ADRB2RL1 Dopamine D2 receptor and serotonin 1a receptor HTR1A | Serotonin receptor 1A
Type:
Mol. Mass.:
46122.49
Organism:
Homo sapiens (Human)
Description:
Residue:
422
  
Inhibitor
Name:
BDBM50399622
Synonyms:
CHEMBL2181168
Type:
Small organic molecule
Emp. Form.:
C21H24IN3O
Mol. Mass.:
461.3392
SMILES:
CCCN1CCC(COc2nc3c(I)cccc3c3ncccc23)CC1
: