Target
Lysosomal acid glucosylceramidase
Ligand
BDBM18361
Substrate
Meas. Tech.
ChEMBL_878842 (CHEMBL2184150)
IC50
70000±n/a nM
Citation
 Kato, AHayashi, EMiyauchi, SAdachi, IImahori, TNatori, YYoshimura, YNash, RJShimaoka, HNakagome, IKoseki, JHirono, STakahata, H a-1-C-butyl-1,4-dideoxy-1,4-imino-l-arabinitol as a second-generation iminosugar-based orala-glucosidase inhibitor for improving postprandial hyperglycemia. J Med Chem 55:10347-62 (2012)  
Target
Name:
Lysosomal acid glucosylceramidase
Synonyms:
Acid beta-glucosidase Beta-glucocerebrosidase D-glucosyl-N-acylsphingosine glucohydrolase GBA1 GC GLUC Glucosylceramidase (GBA) Glucosylceramidase precursor (Beta-glucocerebrosidase) (Acid beta-glucosidase) (D-glucosyl-N-acylsphingosine glucohydrolase) (Alglucerase) (Imiglucerase) beta-glucocerebrosidase (GCase)
Type:
Enzyme
Mol. Mass.:
59724.64
Organism:
Homo sapiens (Human)
Description:
The beta-Glu activity was measured with commercially available beta-glucocerebrosidase (Ceredase) as the enzyme source.
Residue:
536
  
Inhibitor
Name:
BDBM18361
Synonyms:
(2R,3S,4R,5R,6R)-2-butyl-6-(hydroxymethyl)piperidine-3,4,5-triol | alpha-1-C-Butyl-DNJ
Type:
Small organic molecule
Emp. Form.:
C10H21NO4
Mol. Mass.:
219.278
SMILES:
CCCC[C@H]1N[C@H](CO)[C@@H](O)[C@H](O)[C@H]1O
: