Target
Neuronal acetylcholine receptor subunit alpha-7
Ligand
BDBM50399816
Substrate
Meas. Tech.
ChEMBL_877368 (CHEMBL2182413)
Ki
29.1±n/a nM
Citation
 Mazurov, AAKombo, DCHauser, TAMiao, LDull, GGenus, JFFedorov, NBBenson, LSidach, SXiao, YHammond, PSJames, JWMiller, CHYohannes, D Discovery of (2S,3R)-N-[2-(Pyridin-3-ylmethyl)-1-azabicyclo[2.2.2]oct-3-yl]benzo[b]furan-2-carboxamide (TC-5619), a selectivea7 nicotinic acetylcholine receptor agonist, for the treatment of cognitive disorders. J Med Chem 55:9793-809 (2012)  
Target
Name:
Neuronal acetylcholine receptor subunit alpha-7
Synonyms:
ACHA7_RAT Cholinergic, Nicotinic Alpha7 Chrna7 Neuronal acetylcholine receptor (alpha7 nAChR) Neuronal acetylcholine receptor subunit alpha-7 Neuronal acetylcholine receptor subunit alpha-7 (nAChR)
Type:
Enzyme
Mol. Mass.:
56502.44
Organism:
Rattus norvegicus (Rat)
Description:
Q05941
Residue:
502
  
Inhibitor
Name:
BDBM50399816
Synonyms:
CHEMBL2179838
Type:
Small organic molecule
Emp. Form.:
C20H22FN3O
Mol. Mass.:
339.4066
SMILES:
Fc1cccc(c1)C(=O)N[C@@H]1C2CCN(CC2)[C@H]1Cc1cccnc1
: