Target
Neuronal acetylcholine receptor subunit alpha-7
Ligand
BDBM50399820
Substrate
Meas. Tech.
ChEMBL_877370 (CHEMBL2182415)
Ki
29±n/a nM
Citation
 Mazurov, AAKombo, DCHauser, TAMiao, LDull, GGenus, JFFedorov, NBBenson, LSidach, SXiao, YHammond, PSJames, JWMiller, CHYohannes, D Discovery of (2S,3R)-N-[2-(Pyridin-3-ylmethyl)-1-azabicyclo[2.2.2]oct-3-yl]benzo[b]furan-2-carboxamide (TC-5619), a selectivea7 nicotinic acetylcholine receptor agonist, for the treatment of cognitive disorders. J Med Chem 55:9793-809 (2012)  
Target
Name:
Neuronal acetylcholine receptor subunit alpha-7
Synonyms:
ACHA7_HUMAN Cholinergic, Nicotinic Alpha7 Neuronal acetylcholine receptor protein alpha-7 subunit Nicotinic acetylcholine receptor alpha-7 (alpha7 nAChR)
Type:
Mol. Mass.:
56448.33
Organism:
Homo sapiens (Human)
Description:
CHRNA7 (NACHRA7)
Residue:
502
  
Inhibitor
Name:
BDBM50399820
Synonyms:
CHEMBL2180263
Type:
Small organic molecule
Emp. Form.:
C27H26N4O2
Mol. Mass.:
438.5209
SMILES:
O=C(N[C@@H]1C2CCN(CC2)[C@H]1Cc1cccnc1)c1cc2cccc(-c3ccccn3)c2o1
: