Target
Cytochrome P450 3A4
Ligand
BDBM50400098
Substrate
Meas. Tech.
ChEMBL_878086 (CHEMBL2183276)
IC50
17000±n/a nM
Citation
 Luo, GChen, LConway, CMDenton, RKeavy, DSignor, LKostich, WLentz, KASantone, KSSchartman, RBrowning, MTong, GHouston, JGDubowchik, GMMacor, JE Discovery of (5S,6S,9R)-5-amino-6-(2,3-difluorophenyl)-6,7,8,9-tetrahydro-5H-cyclohepta[b]pyridin-9-yl 4-(2-oxo-2,3-dihydro-1H-imidazo[4,5-b]pyridin-1-yl)piperidine-1-carboxylate (BMS-927711): an oral calcitonin gene-related peptide (CGRP) antagonist in clinical trials for treating migraine. J Med Chem 55:10644-51 (2012)  
Target
Name:
Cytochrome P450 3A4
Synonyms:
Albendazole monooxygenase CP3A4_HUMAN CYP3A4 CYPIIIA4 Cytochrome P450 3A4 (CYP3A4) Nifedipine oxidase Taurochenodeoxycholate 6-alpha-hydroxylase
Type:
Enzyme
Mol. Mass.:
57349.57
Organism:
Homo sapiens (Human)
Description:
Residue:
503
  
Inhibitor
Name:
BDBM50400098
Synonyms:
CHEMBL2178422
Type:
Small organic molecule
Emp. Form.:
C28H28F2N6O3
Mol. Mass.:
534.5571
SMILES:
N[C@H]1[C@@H](CC[C@@H](OC(=O)N2CCC(CC2)n2c3cccnc3[nH]c2=O)c2ncccc12)c1cccc(F)c1F
: