Target
Cathepsin D
Ligand
BDBM50400213
Substrate
Meas. Tech.
ChEMBL_878950 (CHEMBL2185513)
IC50
0.126000±n/a nM
Citation
 Liu, YZhang, WLi, LSalvador, LAChen, TChen, WFelsenstein, KMLadd, TBPrice, ARGolde, TEHe, JXu, YLi, YLuesch, H Cyanobacterial peptides as a prototype for the design of potentß-secretase inhibitors and the development of selective chemical probes for other aspartic proteases. J Med Chem 55:10749-65 (2012)  
Target
Name:
Cathepsin D
Synonyms:
CATD_HUMAN CTSD Cathepsin D heavy chain Cathepsin D precursor
Type:
Enzyme
Mol. Mass.:
44551.72
Organism:
Homo sapiens (Human)
Description:
Human proCathepsin D (SwissProt accession number P07339) was expressed in Sf9 cells, purified, and autoactivated.
Residue:
412
  
Inhibitor
Name:
BDBM50400213
Synonyms:
CHEMBL2181024
Type:
Small organic molecule
Emp. Form.:
C52H78N8O12
Mol. Mass.:
1007.2221
SMILES:
COC(=O)[C@@H]1CCCN1C(=O)[C@@H](Cc1ccccc1)N(C)C(=O)[C@H](C)NC(=O)[C@H](CC(C)C)NC(=O)C[C@H](O)[C@H](Cc1ccccc1)NC(=O)[C@H](CCC(N)=O)N(C)C(=O)[C@@H](NC(=O)OC(C)(C)C)C(C)C
: