Target
Carbonic anhydrase 1
Ligand
BDBM50400489
Substrate
Meas. Tech.
ChEMBL_879401 (CHEMBL2208799)
Ki
4563±n/a nM
Citation
 Brzozowski, ZSlawinski, JVullo, DSupuran, CT Carbonic anhydrase inhibitors. Regioselective synthesis of novel series 1-substituted 1,4-dihydro-4-oxo-3-pyridinesulfonamides and their inhibition of the human cytosolic isozymes I and II and transmembrane cancer-associated isozymes IX and XII. Eur J Med Chem 56:282-291 (2012)  
Target
Name:
Carbonic anhydrase 1
Synonyms:
CA-I CAB Carbonate dehydratase I Carbonic anhydrase 1 (CA I) Carbonic anhydrase 1 (Recombinant CA I) Carbonic anhydrase B Carbonic anhydrase I (CA I) Carbonic anhydrase I (CAI) Carbonic anhydrase isoenzyme I (hCA I) | hCA
Type:
Enzyme
Mol. Mass.:
28873.37
Organism:
Homo sapiens (Human)
Description:
P00915
Residue:
261
  
Inhibitor
Name:
BDBM50400489
Synonyms:
CHEMBL2203354
Type:
Small organic molecule
Emp. Form.:
C20H15ClN4O4S
Mol. Mass.:
442.876
SMILES:
NS(=O)(=O)c1cn(Cc2nc3ccccc3c(=O)n2-c2ccc(Cl)cc2)ccc1=O
: