Target
Carbonic anhydrase 9
Ligand
BDBM50400489
Substrate
Meas. Tech.
ChEMBL_879403 (CHEMBL2208801)
Ki
71.2±n/a nM
Citation
 Brzozowski, ZSlawinski, JVullo, DSupuran, CT Carbonic anhydrase inhibitors. Regioselective synthesis of novel series 1-substituted 1,4-dihydro-4-oxo-3-pyridinesulfonamides and their inhibition of the human cytosolic isozymes I and II and transmembrane cancer-associated isozymes IX and XII. Eur J Med Chem 56:282-291 (2012)  
Target
Name:
Carbonic anhydrase 9
Synonyms:
CA-IX CAH9_HUMAN Carbonic anhydrase 9 (CA IX) Carbonic anhydrase 9 precursor Carbonic anhydrase IX (CAIX) Carbonic anhydrases; II & IX MN RCC-associated antigen G250
Type:
Enzyme
Mol. Mass.:
49669.03
Organism:
Homo sapiens (Human)
Description:
Catalytic domain of human cloned isozyme was used in the assay
Residue:
459
  
Inhibitor
Name:
BDBM50400489
Synonyms:
CHEMBL2203354
Type:
Small organic molecule
Emp. Form.:
C20H15ClN4O4S
Mol. Mass.:
442.876
SMILES:
NS(=O)(=O)c1cn(Cc2nc3ccccc3c(=O)n2-c2ccc(Cl)cc2)ccc1=O
: