Target
Receptor-type tyrosine-protein kinase FLT3
Ligand
BDBM50400601
Substrate
Meas. Tech.
ChEMBL_880061 (CHEMBL2213410)
IC50
1±n/a nM
Citation
 Liu, GCampbell, BTHolladay, MWFord Pulido, JMHua, HGitnick, DGardner, MFJames, JBreider, MABrigham, DBelli, BArmstrong, RCTreiber, DK Discovery of AC710, a Globally Selective Inhibitor of Platelet-Derived Growth Factor Receptor-Family Kinases. ACS Med Chem Lett 3:997-1002 (2012)  
Target
Name:
Receptor-type tyrosine-protein kinase FLT3
Synonyms:
CD135 FL cytokine receptor FLK2 FLT3 Fetal liver kinase-2 Fms-like tyrosine kinase 3 (Flt-3) STK-1 Stem cell tyrosine kinase 1
Type:
Enzyme
Mol. Mass.:
112888.62
Organism:
Homo sapiens (Human)
Description:
P36888
Residue:
993
  
Inhibitor
Name:
BDBM50400601
Synonyms:
CHEMBL2203434
Type:
Small organic molecule
Emp. Form.:
C27H34N6O4
Mol. Mass.:
506.5967
SMILES:
CCN1CCC(CC1)Oc1ccc(nc1)C(=O)Nc1ccc(NC(=O)Nc2cc(on2)C(C)(C)C)cc1
: