Target
Macrophage colony-stimulating factor 1 receptor
Ligand
BDBM50400604
Substrate
Meas. Tech.
ChEMBL_880068 (CHEMBL2213417)
IC50
67.4±n/a nM
Citation
 Liu, GCampbell, BTHolladay, MWFord Pulido, JMHua, HGitnick, DGardner, MFJames, JBreider, MABrigham, DBelli, BArmstrong, RCTreiber, DK Discovery of AC710, a Globally Selective Inhibitor of Platelet-Derived Growth Factor Receptor-Family Kinases. ACS Med Chem Lett 3:997-1002 (2012)  
Target
Name:
Macrophage colony-stimulating factor 1 receptor
Synonyms:
CSF1R_MOUSE Csfmr Macrophage colony-stimulating factor 1 receptor Proto-oncogene c-Fms
Type:
Protein
Mol. Mass.:
109173.45
Organism:
Mus musculus (Mouse)
Description:
P09581
Residue:
977
  
Inhibitor
Name:
BDBM50400604
Synonyms:
CHEMBL2203427
Type:
Small organic molecule
Emp. Form.:
C28H36N6O3
Mol. Mass.:
504.6238
SMILES:
CCN1CCC(Cc2ccc(nc2)C(=O)Nc2ccc(NC(=O)Nc3cc(on3)C(C)(C)C)cc2)CC1
: