Target
Protein-glutamine gamma-glutamyltransferase 6
Ligand
BDBM50400619
Substrate
Meas. Tech.
ChEMBL_880181 (CHEMBL2214883)
IC50
>80000±n/a nM
Citation
 Wityak, JPrime, MEBrookfield, FACourtney, SMErfan, SJohnsen, SJohnson, PDLi, MMarston, RWReed, LVaidya, DSchaertl, SPedret-Dunn, ABeconi, MMacdonald, DMuņoz-Sanjuan, IDominguez, C SAR Development of Lysine-Based Irreversible Inhibitors of Transglutaminase 2 for Huntington's Disease. ACS Med Chem Lett 3:1024-1028 (2012)  
Target
Name:
Protein-glutamine gamma-glutamyltransferase 6
Synonyms:
Protein-glutamine gamma-glutamyltransferase 6 TGM3L TGM6 TGase Y TGase-6 Transglutaminase-3-like Transglutaminase-6 (TG6)
Type:
Protein
Mol. Mass.:
79319.01
Organism:
Homo sapiens (Human)
Description:
Residue:
706
  
Inhibitor
Name:
BDBM50400619
Synonyms:
CHEMBL2203476
Type:
Small organic molecule
Emp. Form.:
C23H33N3O6
Mol. Mass.:
447.5246
SMILES:
CC(C)(C)OC(=O)CNC(=O)[C@H](CCCCNC(=O)C=C)NC(=O)OCc1ccccc1
: