Target
Casein kinase I isoform delta
Ligand
BDBM50400754
Substrate
Meas. Tech.
ChEMBL_880535 (CHEMBL2211470)
IC50
59±n/a nM
Citation
 Huang, HAcquaviva, LBerry, VBregman, HChakka, NDiMauro, EFDovey, JEpstein, OGrubinska, BGoldstein, JGunaydin, HHua, ZHuang, XHuang, LHuman, JLong, ANewcomb, JPatel, VFSaffran, DSerafino, RSchneider, SStrathdee, CTang, JTurci, SWhite, RYu, VZhao, HWilson, CMartin, MW Structure-Based Design of Potent and Selective CK1¿ Inhibitors. ACS Med Chem Lett 3:1059-1064 (2012)  
Target
Name:
Casein kinase I isoform delta
Synonyms:
CKI-delta CSNK1D Casein kinase I delta Casein kinase I isoform delta (CK1D) KC1D_HUMAN | casein kinases 1 delta (CK1 delta)
Type:
Enzyme
Mol. Mass.:
47356.76
Organism:
Homo sapiens (Human)
Description:
P48730
Residue:
415
  
Inhibitor
Name:
BDBM50400754
Synonyms:
CHEMBL2203564
Type:
Small organic molecule
Emp. Form.:
C21H20FN3O3
Mol. Mass.:
381.4002
SMILES:
COc1cnc(COc2ccc(F)cc2C)cc1-c1cc2c(CCNC2=O)[nH]1
: