Target
Histone-lysine N-methyltransferase SUV39H1
Ligand
BDBM50400778
Substrate
Meas. Tech.
ChEMBL_879133 (CHEMBL2209104)
IC50
>100000±n/a nM
Citation
 Verma, SKTian, XLaFrance, LVDuquenne, CSuarez, DPNewlander, KARomeril, SPBurgess, JLGrant, SWBrackley, JAGraves, APScherzer, DAShu, AThompson, COtt, HMAller, GSMachutta, CADiaz, EJiang, YJohnson, NWKnight, SDKruger, RGMcCabe, MTDhanak, DTummino, PJCreasy, CLMiller, WH Identification of Potent, Selective, Cell-Active Inhibitors of the Histone Lysine Methyltransferase EZH2. ACS Med Chem Lett 3:1091-1096 (2012)  
Target
Name:
Histone-lysine N-methyltransferase SUV39H1
Synonyms:
H3-K9-HMTase 1 KMT1A Position-effect variegation 3-9 homolog SUV39H1 Su(var)3-9 homolog 1 | Suppressor of variegation 3-9 homolog 1
Type:
PROTEIN
Mol. Mass.:
47917.07
Organism:
Homo sapiens (Human)
Description:
ChEMBL_1473655
Residue:
412
  
Inhibitor
Name:
BDBM50400778
Synonyms:
CHEMBL2204995
Type:
Small organic molecule
Emp. Form.:
C31H39N7O2
Mol. Mass.:
541.6871
SMILES:
CCCc1cc(C)[nH]c(=O)c1CNC(=O)c1cc(cc2n(ncc12)C(C)C)-c1ccnc(c1)N1CCN(C)CC1
: