Target
Growth hormone secretagogue receptor type 1
Ligand
BDBM50359261
Substrate
Meas. Tech.
ChEMBL_879206 (CHEMBL2208519)
Ki
1±n/a nM
Citation
 Marsault, EPeterson, ML Macrocycles are great cycles: applications, opportunities, and challenges of synthetic macrocycles in drug discovery. J Med Chem 54:1961-2004 (2011)  
Target
Name:
Growth hormone secretagogue receptor type 1
Synonyms:
GH-releasing peptide receptor GHS-R GHSR_HUMAN Ghrelin receptor | Ghrelin receptor 1a (GHS-R1a)
Type:
Receptor
Mol. Mass.:
41334.57
Organism:
Homo sapiens (Human)
Description:
Receptor binding studies use plasma membranes from LLC PK-1 cells transiently transfected with hGHSR1a.
Residue:
366
  
Inhibitor
Name:
BDBM50359261
Synonyms:
CHEMBL1923617
Type:
Small organic molecule
Emp. Form.:
C30H41ClN4O4
Mol. Mass.:
557.124
SMILES:
CC[C@H](C)[C@@H]1NCCOc2ccccc2CCCNC(=O)[C@@H](Cc2ccc(Cl)cc2)NC(=O)[C@@H](C)N(C)C1=O
: