Target
17-beta-hydroxysteroid dehydrogenase type 1
Ligand
BDBM50400838
Substrate
Meas. Tech.
ChEMBL_879294 (CHEMBL2208692)
Ki
424500±n/a nM
Citation
 Meanwell, NA Synopsis of some recent tactical application of bioisosteres in drug design. J Med Chem 54:2529-91 (2011)  
Target
Name:
17-beta-hydroxysteroid dehydrogenase type 1
Synonyms:
17-beta-HSD 1 17-beta-hydroxysteroid dehydrogenase type 1 20-alpha-HSD E17KSR EDH17B1 EDHB17 Estradiol 17-beta-dehydrogenase 1 (17beta-HSD1) Placental 17-beta-hydroxysteroid dehydrogenase | SDR28C1
Type:
Enzyme
Mol. Mass.:
34945.13
Organism:
Homo sapiens (Human)
Description:
P14061
Residue:
328
  
Inhibitor
Name:
BDBM50400838
Synonyms:
CHEMBL2205684
Type:
Small organic molecule
Emp. Form.:
C20H23NO2
Mol. Mass.:
309.4021
SMILES:
COc1ccc2[C@H]3CC[C@@]4(C)[C@@H](Cc5cnoc45)[C@@H]3CCc2c1
: