Target
Histamine H3 receptor
Ligand
BDBM50401007
Substrate
Meas. Tech.
ChEMBL_879381 (CHEMBL2208779)
Ki
1.32±n/a nM
Citation
 Wager, TTPettersen, BASchmidt, AWSpracklin, DKMente, SButler, TWHoward, HLettiere, DJRubitski, DMWong, DFNedza, FMNelson, FRRollema, HRaggon, JWAubrecht, JFreeman, JKMarcek, JMCianfrogna, JCook, KWJames, LCChatman, LAIredale, PABanker, MJHomiski, MLMunzner, JBChandrasekaran, RY Discovery of two clinical histamine H(3) receptor antagonists: trans-N-ethyl-3-fluoro-3-[3-fluoro-4-(pyrrolidinylmethyl)phenyl]cyclobutanecarboxamide (PF-03654746) and trans-3-fluoro-3-[3-fluoro-4-(pyrrolidin-1-ylmethyl)phenyl]-N-(2-methylpropyl)cyclobutanecarboxamide (PF-03654764). J Med Chem 54:7602-20 (2011)  
Target
Name:
Histamine H3 receptor
Synonyms:
G-protein coupled receptor 97 HH3R HRH3 Histamine H3 receptor (H3) Histamine receptor (H3 and H4)
Type:
G Protein-Coupled Receptor (GPCR)
Mol. Mass.:
48691.47
Organism:
Homo sapiens (Human)
Description:
Binding assays were using CHO cells stably expressing hH3R receptors.
Residue:
445
  
Inhibitor
Name:
BDBM50401007
Synonyms:
CHEMBL209478
Type:
Small organic molecule
Emp. Form.:
C18H24N2
Mol. Mass.:
268.3966
SMILES:
CN(C)Cc1ccc(cc1)-c1ccc(CN(C)C)cc1
: