Target
3-oxoacyl-[acyl-carrier-protein] synthase 1
Ligand
BDBM50401027
Substrate
Meas. Tech.
ChEMBL_881659 (CHEMBL2209290)
IC50
3800±n/a nM
Citation
 García, ABocanegra-García, VPalma-Nicolás, JPRivera, G Recent advances in antitubercular natural products. Eur J Med Chem 49:1-23 (2012)  
Target
Name:
3-oxoacyl-[acyl-carrier-protein] synthase 1
Synonyms:
β-ketoacyl-ACP synthase I (KasA) Beta-ketoacyl-ACP synthase (KasA) kasA
Type:
Protein
Mol. Mass.:
43305.57
Organism:
Mycobacterium tuberculosis
Description:
P9WQD9
Residue:
416
  
Inhibitor
Name:
BDBM50401027
Synonyms:
CHEMBL2204380
Type:
Small organic molecule
Emp. Form.:
C18H30O3
Mol. Mass.:
294.429
SMILES:
CCCCCCCc1cc(O)c(CCCCCC)c(=O)o1
: