Target
Muscarinic acetylcholine receptor M1
Ligand
BDBM50149891
Substrate
Meas. Tech.
ChEMBL_882199 (CHEMBL2215472)
EC50
170000±n/a nM
Citation
 Daval, SBValant, CBonnet, DKellenberger, EHibert, MGalzi, JLIlien, B Fluorescent derivatives of AC-42 to probe bitopic orthosteric/allosteric binding mechanisms on muscarinic M1 receptors. J Med Chem 55:2125-43 (2012)  
Target
Name:
Muscarinic acetylcholine receptor M1
Synonyms:
ACM1_HUMAN Cholinergic receptor, muscarinic 1 | Cholinergic, muscarinic M1
Type:
Protein
Mol. Mass.:
51442.54
Organism:
Homo sapiens (Human)
Description:
P11229
Residue:
460
  
Inhibitor
Name:
BDBM50149891
Synonyms:
2,2',2''-[1,2,3-BENZENE-TRIYLTRIS(OXY)]TRIS[N,N,N-TRIETHYLETHANAMINIUM] GALLAMINE
Type:
Small organic molecule
Emp. Form.:
C30H60N3O3
Mol. Mass.:
510.8141
SMILES:
CC[N+](CC)(CC)CCOc1cccc(OCC[N+](CC)(CC)CC)c1OCC[N+](CC)(CC)CC
: