Target
Trace amine-associated receptor 1
Ligand
BDBM106583
Substrate
Meas. Tech.
ChEMBL_882013 (CHEMBL2213508)
EC50
37±n/a nM
Citation
 Galley, GStalder, HGoergler, AHoener, MCNorcross, RD Optimisation of imidazole compounds as selective TAAR1 agonists: discovery of RO5073012. Bioorg Med Chem Lett 22:5244-8 (2012)  
Target
Name:
Trace amine-associated receptor 1
Synonyms:
TA1 TAAR1_HUMAN TRAR1 | trace amine-associated receptor 1
Type:
PROTEIN
Mol. Mass.:
39107.47
Organism:
Homo sapiens (Human)
Description:
ChEMBL_792734
Residue:
339
  
Inhibitor
Name:
BDBM106583
Synonyms:
CHEMBL2206381 | US8586617, 25
Type:
Small organic molecule
Emp. Form.:
C14H19N3O
Mol. Mass.:
245.3202
SMILES:
COc1cccc(c1)N(Cc1cnc[nH]1)C(C)C
: