Target
Trace amine-associated receptor 1
Ligand
BDBM106582
Substrate
Meas. Tech.
ChEMBL_882013 (CHEMBL2213508)
EC50
4.6±n/a nM
Citation
 Galley, GStalder, HGoergler, AHoener, MCNorcross, RD Optimisation of imidazole compounds as selective TAAR1 agonists: discovery of RO5073012. Bioorg Med Chem Lett 22:5244-8 (2012)  
Target
Name:
Trace amine-associated receptor 1
Synonyms:
TA1 TAAR1_HUMAN TRAR1 | trace amine-associated receptor 1
Type:
PROTEIN
Mol. Mass.:
39107.47
Organism:
Homo sapiens (Human)
Description:
ChEMBL_792734
Residue:
339
  
Inhibitor
Name:
BDBM106582
Synonyms:
CHEMBL2206890 | US8586617, 23
Type:
Small organic molecule
Emp. Form.:
C13H16ClN3
Mol. Mass.:
249.739
SMILES:
CC(C)N(Cc1cnc[nH]1)c1cccc(Cl)c1
: