Target
C-C chemokine receptor type 1
Ligand
BDBM50401344
Substrate
Meas. Tech.
ChEMBL_884032 (CHEMBL2215081)
IC50
5011.87±n/a nM
Citation
 Thiele, SMalmgaard-Clausen, MEngel-Andreasen, JSteen, ARummel, PCNielsen, MCGloriam, DEFrimurer, TMUlven, TRosenkilde, MM Modulation in selectivity and allosteric properties of small-molecule ligands for CC-chemokine receptors. J Med Chem 55:8164-77 (2012)  
Target
Name:
C-C chemokine receptor type 1
Synonyms:
C-C CKR-1 CC-CKR-1 CCR1 CD_antigen=CD191 CMKR1 LD78 receptor Macrophage inflammatory protein 1-alpha receptor SCYAR1
Type:
Enzyme
Mol. Mass.:
41180.69
Organism:
Homo sapiens (Human)
Description:
P32246
Residue:
355
  
Inhibitor
Name:
BDBM50401344
Synonyms:
CHEMBL317115
Type:
Small organic molecule
Emp. Form.:
C12H7ClN2
Mol. Mass.:
214.65
SMILES:
Clc1cc2cccnc2c2ncccc12
: