Target
Tyrosine-protein phosphatase non-receptor type 2
Ligand
BDBM50236238
Substrate
Meas. Tech.
ChEMBL_882108 (CHEMBL2214496)
IC50
20450±n/a nM
Citation
 He, HBGao, LXDeng, QFMa, WPTang, CLQiu, WWTang, JLi, JYLi, JYang, F Synthesis and biological evaluation of 4,4-dimethyl lithocholic acid derivatives as novel inhibitors of protein tyrosine phosphatase 1B. Bioorg Med Chem Lett 22:7237-42 (2012)  
Target
Name:
Tyrosine-protein phosphatase non-receptor type 2
Synonyms:
PTN2_HUMAN PTPT T-cell protein-tyrosine phosphatase TCPTP Tyrosine-protein phosphatase non-receptor type 2 (TC-PTP)
Type:
Protein
Mol. Mass.:
48481.80
Organism:
Homo sapiens (Human)
Description:
P17706
Residue:
415
  
Inhibitor
Name:
BDBM50236238
Synonyms:
(3alpha,5beta)-3-hydroxycholan-24-oic acid 3alpha-hydroxy-5beta-cholanic acid 5beta-cholanic acid-3alpha-ol LCA lithocholic acid
Type:
Small organic molecule
Emp. Form.:
C24H40O3
Mol. Mass.:
376.5726
SMILES:
C[C@H](CCC(O)=O)[C@H]1CC[C@H]2[C@@H]3CC[C@@H]4C[C@H](O)CC[C@]4(C)[C@H]3CC[C@]12C
: