Target
Transporter
Ligand
BDBM50005548
Substrate
Meas. Tech.
ChEMBL_885010 (CHEMBL2211270)
Ki
20±n/a nM
Citation
 Pechulis, ADBeck, JPCurry, MAWolf, MAHarms, AEXi, NOpalka, CSweet, MPYang, ZVellekoop, ASKlos, AMCrocker, PJHassler, CLaws, MKitchen, DBSmith, MAOlson, RELiu, SMolino, BF 4-Phenyl tetrahydroisoquinolines as dual norepinephrine and dopamine reuptake inhibitors. Bioorg Med Chem Lett 22:7219-22 (2012)  
Target
Name:
Transporter
Synonyms:
NE transporter Norepinephrine transporter(NET)
Type:
Multi-pass membrane protein
Mol. Mass.:
69236.90
Organism:
Rattus norvegicus (rat)
Description:
Q63380
Residue:
617
  
Inhibitor
Name:
BDBM50005548
Synonyms:
(+)-2-Methyl-4-phenyl-1,2,3,4-tetrahydro-isoquinolin-8-ylamine (-)-2-Methyl-4-phenyl-1,2,3,4-tetrahydro-isoquinolin-8-ylamine 2-Methyl-4-phenyl-1,2,3,4-tetrahydro-isoquinolin-8-ylamine 2-Methyl-4-phenyl-1,2,3,4-tetrahydro-isoquinolin-8-ylamine(Nomifensine) CHEMBL273575 NOMIFENSINE2-Methyl-4-phenyl-1,2,3,4-tetrahydro-isoquinolin-8-ylamine
Type:
Small organic molecule
Emp. Form.:
C16H18N2
Mol. Mass.:
238.3275
SMILES:
CN1CC(c2ccccc2)c2cccc(N)c2C1
: