Target
Cathepsin S
Ligand
BDBM50401814
Substrate
Meas. Tech.
ChEMBL_885155 (CHEMBL2213246)
IC50
0.5±n/a nM
Citation
 Moss, NXiong, ZBurke, MCogan, DGao, DAHaverty, KHeim-Riether, AHickey, ERNagaraja, RNetherton, MO'Shea, KRamsden, PSchwartz, RShih, DTWard, YYoung, EZhang, Q Exploration of cathepsin S inhibitors characterized by a triazole P1-P2 amide replacement. Bioorg Med Chem Lett 22:7189-93 (2012)  
Target
Name:
Cathepsin S
Synonyms:
CATS_HUMAN Cathepsin S (Cat S) | cathepsin S preproprotein
Type:
Protein
Mol. Mass.:
37507.38
Organism:
Homo sapiens (Human)
Description:
P25774
Residue:
331
  
Inhibitor
Name:
BDBM50401814
Synonyms:
CHEMBL2207591
Type:
Small organic molecule
Emp. Form.:
C24H28N6O2
Mol. Mass.:
432.5181
SMILES:
O=C(Nc1ccc(cc1)C(=O)N[C@@H](C1CCCCC1)c1cn(nn1)C1(CC1)C#N)C1CC1
: