Target
Cathepsin S
Ligand
BDBM50401760
Substrate
Meas. Tech.
ChEMBL_885155 (CHEMBL2213246)
IC50
1.1±n/a nM
Citation
 Moss, NXiong, ZBurke, MCogan, DGao, DAHaverty, KHeim-Riether, AHickey, ERNagaraja, RNetherton, MO'Shea, KRamsden, PSchwartz, RShih, DTWard, YYoung, EZhang, Q Exploration of cathepsin S inhibitors characterized by a triazole P1-P2 amide replacement. Bioorg Med Chem Lett 22:7189-93 (2012)  
Target
Name:
Cathepsin S
Synonyms:
CATS_HUMAN Cathepsin S (Cat S) | cathepsin S preproprotein
Type:
Protein
Mol. Mass.:
37507.38
Organism:
Homo sapiens (Human)
Description:
P25774
Residue:
331
  
Inhibitor
Name:
BDBM50401760
Synonyms:
CHEMBL2207568
Type:
Small organic molecule
Emp. Form.:
C19H23N5OS
Mol. Mass.:
369.484
SMILES:
C[C@](NC(=O)c1ccsc1)(C1CCCCC1)c1cn(nn1)C1(CC1)C#N
: