Target
Cathepsin S
Ligand
BDBM50401763
Substrate
Meas. Tech.
ChEMBL_885155 (CHEMBL2213246)
IC50
0.1±n/a nM
Citation
 Moss, NXiong, ZBurke, MCogan, DGao, DAHaverty, KHeim-Riether, AHickey, ERNagaraja, RNetherton, MO'Shea, KRamsden, PSchwartz, RShih, DTWard, YYoung, EZhang, Q Exploration of cathepsin S inhibitors characterized by a triazole P1-P2 amide replacement. Bioorg Med Chem Lett 22:7189-93 (2012)  
Target
Name:
Cathepsin S
Synonyms:
CATS_HUMAN Cathepsin S (Cat S) | cathepsin S preproprotein
Type:
Protein
Mol. Mass.:
37507.38
Organism:
Homo sapiens (Human)
Description:
P25774
Residue:
331
  
Inhibitor
Name:
BDBM50401763
Synonyms:
CHEMBL2207565
Type:
Small organic molecule
Emp. Form.:
C18H23N5OS
Mol. Mass.:
357.473
SMILES:
C[C@H]1CC[C@@H](CC1)[C@](C)(NC(=O)c1ccsc1)c1cn(CC#N)nn1
: