Target
Cathepsin S
Ligand
BDBM19496
Substrate
Meas. Tech.
ChEMBL_885155 (CHEMBL2213246)
IC50
2.5±n/a nM
Citation
 Moss, NXiong, ZBurke, MCogan, DGao, DAHaverty, KHeim-Riether, AHickey, ERNagaraja, RNetherton, MO'Shea, KRamsden, PSchwartz, RShih, DTWard, YYoung, EZhang, Q Exploration of cathepsin S inhibitors characterized by a triazole P1-P2 amide replacement. Bioorg Med Chem Lett 22:7189-93 (2012)  
Target
Name:
Cathepsin S
Synonyms:
CATS_HUMAN Cathepsin S (Cat S) | cathepsin S preproprotein
Type:
Protein
Mol. Mass.:
37507.38
Organism:
Homo sapiens (Human)
Description:
P25774
Residue:
331
  
Inhibitor
Name:
BDBM19496
Synonyms:
(2R)-N-(1-cyanocyclopropyl)-3-methanesulfonyl-2-{[(1S)-2,2,2-trifluoro-1-(4-fluorophenyl)ethyl]amino}propanamide | trifluoroethylamine inhibitor, 6
Type:
Small organic molecule
Emp. Form.:
C16H17F4N3O3S
Mol. Mass.:
407.383
SMILES:
CS(=O)(=O)C[C@H](N[C@@H](c1ccc(F)cc1)C(F)(F)F)C(=O)NC1(CC1)C#N
: