Target
Cathepsin S
Ligand
BDBM50401768
Substrate
Meas. Tech.
ChEMBL_885155 (CHEMBL2213246)
IC50
1.6±n/a nM
Citation
 Moss, NXiong, ZBurke, MCogan, DGao, DAHaverty, KHeim-Riether, AHickey, ERNagaraja, RNetherton, MO'Shea, KRamsden, PSchwartz, RShih, DTWard, YYoung, EZhang, Q Exploration of cathepsin S inhibitors characterized by a triazole P1-P2 amide replacement. Bioorg Med Chem Lett 22:7189-93 (2012)  
Target
Name:
Cathepsin S
Synonyms:
CATS_HUMAN Cathepsin S (Cat S) | cathepsin S preproprotein
Type:
Protein
Mol. Mass.:
37507.38
Organism:
Homo sapiens (Human)
Description:
P25774
Residue:
331
  
Inhibitor
Name:
BDBM50401768
Synonyms:
CHEMBL2207560
Type:
Small organic molecule
Emp. Form.:
C18H28N4O3
Mol. Mass.:
348.4399
SMILES:
O=C(NC1(CC1)C#N)[C@H](CC1CCCCC1)NC(=O)N1CCOCC1
: