Target
Cathepsin S
Ligand
BDBM50401770
Substrate
Meas. Tech.
ChEMBL_885155 (CHEMBL2213246)
IC50
1.5±n/a nM
Citation
 Moss, NXiong, ZBurke, MCogan, DGao, DAHaverty, KHeim-Riether, AHickey, ERNagaraja, RNetherton, MO'Shea, KRamsden, PSchwartz, RShih, DTWard, YYoung, EZhang, Q Exploration of cathepsin S inhibitors characterized by a triazole P1-P2 amide replacement. Bioorg Med Chem Lett 22:7189-93 (2012)  
Target
Name:
Cathepsin S
Synonyms:
CATS_HUMAN Cathepsin S (Cat S) | cathepsin S preproprotein
Type:
Protein
Mol. Mass.:
37507.38
Organism:
Homo sapiens (Human)
Description:
P25774
Residue:
331
  
Inhibitor
Name:
BDBM50401770
Synonyms:
CHEMBL1236882
Type:
Small organic molecule
Emp. Form.:
C21H35N5O3
Mol. Mass.:
405.5343
SMILES:
CN1CCC(CC1)(NC(=O)[C@H](CC1CCCCC1)NC(=O)N1CCOCC1)C#N
: