Target
Cathepsin S
Ligand
BDBM50401808
Substrate
Meas. Tech.
ChEMBL_885153 (CHEMBL2213244)
IC50
4±n/a nM
Citation
 Moss, NXiong, ZBurke, MCogan, DGao, DAHaverty, KHeim-Riether, AHickey, ERNagaraja, RNetherton, MO'Shea, KRamsden, PSchwartz, RShih, DTWard, YYoung, EZhang, Q Exploration of cathepsin S inhibitors characterized by a triazole P1-P2 amide replacement. Bioorg Med Chem Lett 22:7189-93 (2012)  
Target
Name:
Cathepsin S
Synonyms:
CATS_HUMAN Cathepsin S (Cat S) | cathepsin S preproprotein
Type:
Protein
Mol. Mass.:
37507.38
Organism:
Homo sapiens (Human)
Description:
P25774
Residue:
331
  
Inhibitor
Name:
BDBM50401808
Synonyms:
CHEMBL2207153
Type:
Small organic molecule
Emp. Form.:
C21H27N5
Mol. Mass.:
349.4726
SMILES:
C[C@](NCc1ccccc1)(C1CCCCC1)c1cn(nn1)C1(CC1)C#N
: