Target
Hemagglutinin
Ligand
BDBM50402143
Substrate
Meas. Tech.
ChEMBL_884910 (CHEMBL2209966)
pH
5±n/a
IC50
3700±n/a nM
Comments
extracted
Citation
 Göktas, FVanderlinden, ENaesens, LCesur, NCesur, Z Microwave assisted synthesis and anti-influenza virus activity of 1-adamantyl substituted N-(1-thia-4-azaspiro[4.5]decan-4-yl)carboxamide derivatives. Bioorg Med Chem 20:7155-9 (2012)  
Target
Name:
Hemagglutinin
Synonyms:
HA Influenza A virus Hemagglutinin
Type:
PROTEIN
Mol. Mass.:
63574.85
Organism:
Influenza A virus (strain A/X-31 H3N2)
Description:
ChEMBL_884910
Residue:
566
  
Inhibitor
Name:
BDBM50402143
Synonyms:
CHEMBL2207978
Type:
Small organic molecule
Emp. Form.:
C21H32N2O2S
Mol. Mass.:
376.556
SMILES:
CC1SC2(CCC(C)CC2)N(NC(=O)C23CC4CC(CC(C4)C2)C3)C1=O
: