Target
Amine oxidase [flavin-containing] B
Ligand
BDBM50402325
Substrate
Meas. Tech.
ChEMBL_885769 (CHEMBL2213280)
IC50
781±n/a nM
Citation
 Mostert, SMentz, WPetzer, ABergh, JJPetzer, JP Inhibition of monoamine oxidase by 8-[(phenylethyl)sulfanyl]caffeine analogues. Bioorg Med Chem 20:7040-50 (2012)  
Target
Name:
Amine oxidase [flavin-containing] B
Synonyms:
AOFB_HUMAN MAOB Monoamine oxidase type B (MAO B) Monoamine oxidase type B (MAOB)
Type:
Protein
Mol. Mass.:
58768.76
Organism:
Homo sapiens (Human)
Description:
P27338
Residue:
520
  
Inhibitor
Name:
BDBM50402325
Synonyms:
CHEMBL2206098
Type:
Small organic molecule
Emp. Form.:
C16H17ClN4O3S
Mol. Mass.:
380.849
SMILES:
Cn1c(nc2n(C)c(=O)n(C)c(=O)c12)S(=O)CCc1ccc(Cl)cc1
: