Target
Bone morphogenetic protein 1
Ligand
BDBM13102
Substrate
Meas. Tech.
ChEMBL_886679 (CHEMBL2216696)
IC50
112000±n/a nM
Citation
 Turtle, EChow, NYang, CSosa, SBauer, UBrenner, MSolow-Cordero, DHo, WB Design and synthesis of procollagen C-proteinase inhibitors. Bioorg Med Chem Lett 22:7397-401 (2012)  
Target
Name:
Bone morphogenetic protein 1
Synonyms:
BMP-1 BMP1_HUMAN PCOLC Procollagen C-proteinase | mTld
Type:
PROTEIN
Mol. Mass.:
111254.03
Organism:
Homo sapiens (Human)
Description:
ChEMBL_518962
Residue:
986
  
Inhibitor
Name:
BDBM13102
Synonyms:
2-[butan-2-yl(4-methoxybenzene)sulfonamido]-N-hydroxyacetamide | CGS 27023A Analog 30
Type:
Small organic molecule
Emp. Form.:
C13H20N2O5S
Mol. Mass.:
316.373
SMILES:
CCC(C)N(CC(=O)NO)S(=O)(=O)c1ccc(OC)cc1
: