Target
C-C chemokine receptor type 3
Ligand
BDBM50402819
Substrate
Meas. Tech.
ChEMBL_887257 (CHEMBL2215813)
Ki
2.51±n/a nM
Citation
 Furber, MAlcaraz, LLuckhurst, CBahl, ABeaton, HBowers, KCollington, JDenton, RDonald, DKinchin, EMacDonald, CRigby, ARiley, RSoars, MSpringthorpe, BWebborn, P Discovery and evolution of phenoxypiperidine hydroxyamide dual CCR3/H1 antagonists. Part I. Bioorg Med Chem Lett 22:7702-6 (2012)  
Target
Name:
C-C chemokine receptor type 3
Synonyms:
C-C CKR-3 CC-CKR-3 CCR3 CD_antigen=CD193 CMKBR3 | Eosinophil eotaxin receptor
Type:
Enzyme
Mol. Mass.:
41053.88
Organism:
Homo sapiens (Human)
Description:
P51677
Residue:
355
  
Inhibitor
Name:
BDBM50402819
Synonyms:
CHEMBL2208433
Type:
Small organic molecule
Emp. Form.:
C25H27Cl2N3O4
Mol. Mass.:
504.406
SMILES:
CN(C[C@@H](O)CN1CCC(CC1)Oc1ccc(Cl)c(Cl)c1)C(=O)c1c[nH]c(=O)c2ccccc12
: