Target
Carnitine O-palmitoyltransferase 1, muscle isoform
Ligand
BDBM50118093
Substrate
Meas. Tech.
ChEMBL_887462 (CHEMBL2217071)
IC50
60300±n/a nM
Citation
 Ceccarelli, SMChomienne, OGubler, MArduini, A Carnitine palmitoyltransferase (CPT) modulators: a medicinal chemistry perspective on 35 years of research. J Med Chem 54:3109-52 (2011)  
Target
Name:
Carnitine O-palmitoyltransferase 1, muscle isoform
Synonyms:
CPT I CPT1B CPTI-M Carnitine palmitoyltransferase I-like protein | KIAA1670
Type:
PROTEIN
Mol. Mass.:
87823.36
Organism:
Homo sapiens (Human)
Description:
ChEMBL_887440
Residue:
772
  
Inhibitor
Name:
BDBM50118093
Synonyms:
(4-Hydroxy-phenyl)-oxo-acetic acid | CHEMBL129918
Type:
Small organic molecule
Emp. Form.:
C8H6O4
Mol. Mass.:
166.1308
SMILES:
OC(=O)C(=O)c1ccc(O)cc1
: