Target
Carnitine O-palmitoyltransferase 1, muscle isoform
Ligand
BDBM50403032
Substrate
Meas. Tech.
ChEMBL_887462 (CHEMBL2217071)
IC50
85300±n/a nM
Citation
 Ceccarelli, SMChomienne, OGubler, MArduini, A Carnitine palmitoyltransferase (CPT) modulators: a medicinal chemistry perspective on 35 years of research. J Med Chem 54:3109-52 (2011)  
Target
Name:
Carnitine O-palmitoyltransferase 1, muscle isoform
Synonyms:
CPT I CPT1B CPTI-M Carnitine palmitoyltransferase I-like protein | KIAA1670
Type:
PROTEIN
Mol. Mass.:
87823.36
Organism:
Homo sapiens (Human)
Description:
ChEMBL_887440
Residue:
772
  
Inhibitor
Name:
BDBM50403032
Synonyms:
CHEMBL2216785
Type:
Small organic molecule
Emp. Form.:
C24H41N3O5
Mol. Mass.:
451.5994
SMILES:
CCCCCCOc1cccc(OCCCCNC(=O)N[C@H](CC([O-])=O)C[N+](C)(C)C)c1
: