Target
Carnitine O-palmitoyltransferase 1, muscle isoform
Ligand
BDBM80613
Substrate
Meas. Tech.
ChEMBL_887462 (CHEMBL2217071)
IC50
>100000±n/a nM
Citation
 Ceccarelli, SMChomienne, OGubler, MArduini, A Carnitine palmitoyltransferase (CPT) modulators: a medicinal chemistry perspective on 35 years of research. J Med Chem 54:3109-52 (2011)  
Target
Name:
Carnitine O-palmitoyltransferase 1, muscle isoform
Synonyms:
CPT I CPT1B CPTI-M Carnitine palmitoyltransferase I-like protein | KIAA1670
Type:
PROTEIN
Mol. Mass.:
87823.36
Organism:
Homo sapiens (Human)
Description:
ChEMBL_887440
Residue:
772
  
Inhibitor
Name:
BDBM80613
Synonyms:
1-(2,3,4-Trimethoxy-benzyl)-piperazine 1-[(2,3,4-trimethoxyphenyl)methyl]piperazine;hydrochloride SMR000674573 cid_9926449
Type:
Small organic molecule
Emp. Form.:
C14H22N2O3
Mol. Mass.:
266.3361
SMILES:
COc1ccc(CN2CCNCC2)c(OC)c1OC
: