Target
Carnitine O-palmitoyltransferase 1, muscle isoform
Ligand
BDBM50403040
Substrate
Meas. Tech.
ChEMBL_887462 (CHEMBL2217071)
IC50
>100000±n/a nM
Citation
 Ceccarelli, SMChomienne, OGubler, MArduini, A Carnitine palmitoyltransferase (CPT) modulators: a medicinal chemistry perspective on 35 years of research. J Med Chem 54:3109-52 (2011)  
Target
Name:
Carnitine O-palmitoyltransferase 1, muscle isoform
Synonyms:
CPT I CPT1B CPTI-M Carnitine palmitoyltransferase I-like protein | KIAA1670
Type:
PROTEIN
Mol. Mass.:
87823.36
Organism:
Homo sapiens (Human)
Description:
ChEMBL_887440
Residue:
772
  
Inhibitor
Name:
BDBM50403040
Synonyms:
CHEMBL2216779
Type:
Small organic molecule
Emp. Form.:
C23H19ClN2O6S
Mol. Mass.:
486.925
SMILES:
COc1ccc(Cl)cc1S(=O)(=O)N1CCc2ccc(cc12)C(=O)Nc1ccc(cc1)C(O)=O
: