Target
Mitogen-activated protein kinase kinase kinase 1
Ligand
BDBM50403055
Substrate
Meas. Tech.
ChEMBL_887644 (CHEMBL2217253)
IC50
31±n/a nM
Citation
 Barf, TKaptein, A Irreversible protein kinase inhibitors: balancing the benefits and risks. J Med Chem 55:6243-62 (2012)  
Target
Name:
Mitogen-activated protein kinase kinase kinase 1
Synonyms:
M3K1_HUMAN MAPK/ERK kinase kinase 1 MEK Kinase 1 (MEKK1) MEKK1
Type:
Serine/threonine-protein kinase
Mol. Mass.:
164491.32
Organism:
Homo sapiens (Human)
Description:
Residue:
1512
  
Inhibitor
Name:
BDBM50403055
Synonyms:
CHEMBL2216826
Type:
Small organic molecule
Emp. Form.:
C21H27NO6
Mol. Mass.:
389.4422
SMILES:
CCNc1cc(O)c2c(CCCC(=O)C(=O)C(=O)CC[C@H](C)[C@H](C)OC2=O)c1
: