Target
Dual specificity mitogen-activated protein kinase kinase 1
Ligand
BDBM50403055
Substrate
Meas. Tech.
ChEMBL_887641 (CHEMBL2217250)
IC50
5.2±n/a nM
Citation
 Barf, TKaptein, A Irreversible protein kinase inhibitors: balancing the benefits and risks. J Med Chem 55:6243-62 (2012)  
Target
Name:
Dual specificity mitogen-activated protein kinase kinase 1
Synonyms:
Dual specificity mitogen-activated protein kinase (MEK) Dual specificity mitogen-activated protein kinase kinase 1 (MEK1) Dual specificity mitogen-activated protein kinase kinase MEK1/2 MAP kinase kinase 1 MAPK/ERK kinase 1 MEK-1 MP2K1_HUMAN PRKMK1 | VHL-MAP2K1/MAP2K2
Type:
Other Protein Type
Mol. Mass.:
43439.03
Organism:
Homo sapiens (Human)
Description:
Full-length human MEK-1 was generated by PCR and purified as a fusion protein from Escherichia coli lysates.
Residue:
393
  
Inhibitor
Name:
BDBM50403055
Synonyms:
CHEMBL2216826
Type:
Small organic molecule
Emp. Form.:
C21H27NO6
Mol. Mass.:
389.4422
SMILES:
CCNc1cc(O)c2c(CCCC(=O)C(=O)C(=O)CC[C@H](C)[C@H](C)OC2=O)c1
: