Target
Prothrombin
Ligand
BDBM50403286
Substrate
Meas. Tech.
ChEMBL_207949 (CHEMBL811065)
IC50
>40000±n/a nM
Citation
 Misra, RNKelly, YFBrown, BRRoberts, DGChong, SSeiler, SM Argatroban analogs: Synthesis, thrombin inhibitory activity and cell permeability of aminoheterocyclic guanidine surrogates Bioorg Med Chem Lett 4:2165-2170 (1994)    Article 
Target
Name:
Prothrombin
Synonyms:
Activation peptide fragment 1 Coagulation factor II Prothrombin precursor Thrombin heavy chain | Thrombin light chain
Type:
Protein
Mol. Mass.:
70029.57
Organism:
Homo sapiens (Human)
Description:
P00734
Residue:
622
  
Inhibitor
Name:
BDBM50403286
Synonyms:
CHEMBL304592
Type:
Small organic molecule
Emp. Form.:
C25H31N5O3S
Mol. Mass.:
481.61
SMILES:
CC1CCN(CC1)C(=O)[C@H](CCCNc1cnccn1)NS(=O)(=O)c1ccc2ccccc2c1
: