Target
5-hydroxytryptamine receptor 2A
Ligand
BDBM50403988
Substrate
Meas. Tech.
ChEBML_2507
IC50
<1000±n/a nM
Citation
 Andrés, JIAlcázar, JAlonso, JMDíaz, AFernández, JGil, PIturrino, LMatesanz, EMeert, TFMegens, ASipido, VK Synthesis and structure-activity relationship of 2-(aminoalkyl)-2,3,3a,8-tetrahydrodibenzo[c,f]isoxazolo[2,3-a]azepine derivatives: a novel series of 5-HT(2A/2C) receptor antagonists. Part 2. Bioorg Med Chem Lett 12:249-53 (2001)  
Target
Name:
5-hydroxytryptamine receptor 2A
Synonyms:
5-HT-2 5-HT2A 5-hydroxytryptamine receptor 2A (5HT-2A) 5HT2A_HUMAN HTR2A | Serotonin receptor 2A
Type:
undefined
Mol. Mass.:
52607.65
Organism:
Homo sapiens (Human)
Description:
P28223
Residue:
471
  
Inhibitor
Name:
BDBM50403988
Synonyms:
CHEMBL86091
Type:
Small organic molecule
Emp. Form.:
C20H21F3N2O
Mol. Mass.:
362.3887
SMILES:
CN(C)CC1CC2N(O1)c1ccccc1Cc1ccc(cc21)C(F)(F)F
: