Target
D(2) dopamine receptor
Ligand
BDBM50073272
Substrate
Meas. Tech.
ChEBML_60942
Ki
46±n/a nM
Citation
 González-Gómez, JCSantana, LUriarte, EBrea, JVillazón, MLoza, MIDe Luca, MRivas, MEMontenegro, GYFontenla, JA New arylpiperazine derivatives with high affinity for alpha1A, D2 and 5-HT2A receptors. Bioorg Med Chem Lett 13:175-8 (2002)  
Target
Name:
D(2) dopamine receptor
Synonyms:
DOPAMINE D2 DOPAMINE D2 Short Dopamine D2 receptor Drd2
Type:
G Protein-Coupled Receptor (GPCR)
Mol. Mass.:
50931.60
Organism:
Rattus norvegicus (rat)
Description:
P61169
Residue:
444
  
Inhibitor
Name:
BDBM50073272
Synonyms:
4-Methyl-7-[3-(4-phenyl-piperazin-1-yl)-propoxy]-chromen-2-one | CHEMBL52096
Type:
Small organic molecule
Emp. Form.:
C23H26N2O3
Mol. Mass.:
378.4641
SMILES:
Cc1cc(=O)oc2cc(OCCCN3CCN(CC3)c3ccccc3)ccc12
: