Target
Beta-1 adrenergic receptor
Ligand
BDBM25761
Substrate
Meas. Tech.
ChEMBL_76500 (CHEMBL687609)
Kd
2.4±n/a nM
Citation
 Leclerc, GBieth, NSchwartz, J Synthesis and beta-adrenergic blocking activity of new aliphatic oxime ethers. J Med Chem 23:620-4 (1980)  
Target
Name:
Beta-1 adrenergic receptor
Synonyms:
ADRB1 adrenergic Beta1
Type:
Enzyme Catalytic Domain
Mol. Mass.:
50540.48
Organism:
GUINEA PIG
Description:
adrenergic Beta1 ADRB1 GUINEA PIG::B0FL73
Residue:
467
  
Inhibitor
Name:
BDBM25761
Synonyms:
Anapriline CHEMBL27 PROPRANOLOL, d PROPRANOLOL,(+) Propanolol Propranolol | [2-hydroxy-3-(naphthalen-1-yloxy)propyl](propan-2-yl)amine
Type:
Small organic molecule
Emp. Form.:
C16H21NO2
Mol. Mass.:
259.3434
SMILES:
CC(C)NCC(O)COc1cccc2ccccc12
: